Message: previous - next
Month: November 2012

Re: [trinity-devel] Konqueror opens slowly (KMail too)

From: Darrell Anderson <humanreadable@...>
Date: Thu, 15 Nov 2012 19:47:35 -0800 (PST)
Here is another build failure with the latest GIT. I can't find any file on my system containing the string "kdeui" in the file name or in the directory. Something modifes tdevelop/lib/interfaces/external/CMakeLists.txt during the build to link to kdeui-shared. I don't see any patches to tdevelop in the past several days since my last full package set build.

make[2]: Entering directory `/dev/shm/'
/usr/bin/cmake -E cmake_progress_report /dev/shm/
[ 10%] Building CXX object lib/interfaces/external/CMakeFiles/kinterfacedesigner-shared.dir/designer.cpp.o
cd /dev/shm/ && /usr/bin/c++   -Dkinterfacedesigner_shared_EXPORTS -DHAVE_CONFIG_H -DQT_NO_ASCII_CAST -DQT_CLEAN_NAMESPACE -DQT_NO_STL -DQT_NO_COMPAT -DQT_NO_TRANSLATION -DQT_THREAD_SUPPORT -D_REENTRANT -O2 -march=i486 -mtune=i686 -ggdb -include tqt.h -fPIC -I/dev/shm/ -I/opt/trinity/include -I/usr/include/tqt   -include tqt.h -o CMakeFiles/kinterfacedesigner-shared.dir/designer.cpp.o -c /dev/shm/tdevelop/lib/interfaces/external/designer.cpp
Linking CXX shared library
cd /dev/shm/ && /usr/bin/cmake -E cmake_link_script CMakeFiles/kinterfacedesigner-shared.dir/link.txt --verbose=1
/usr/bin/c++  -fPIC -O2 -march=i486 -mtune=i686 -ggdb -include tqt.h -Wl,--no-undefined -shared -Wl,-soname, -o CMakeFiles/kinterfacedesigner-shared.dir/designer.cpp.o /opt/trinity/lib/ -lkdeui-shared /opt/trinity/lib/ /opt/trinity/lib/ -lfreetype -lfontconfig /opt/trinity/lib/ -lutil /opt/trinity/lib/ /opt/trinity/lib/ /opt/trinity/lib/ /opt/trinity/lib/ -ltqt -ltqt-mt -lXrender -lX11 -lz -lidn -lXcomposite -lXfixes -lICE -lSM -ludev -lgamin-1
/usr/lib/gcc/i486-slackware-linux/4.4.4/../../../../i486-slackware-linux/bin/ld: cannot find -lkdeui-shared
collect2: ld returned 1 exit status
make[2]: *** [lib/interfaces/external/] Error 1
make[2]: Leaving directory `/dev/shm/'
make[1]: *** [lib/interfaces/external/CMakeFiles/kinterfacedesigner-shared.dir/all] Error 2
make[1]: Leaving directory `/dev/shm/'
make: *** [all] Error 2
There was an error trying to build tdevelop.