Message: previous - next
Month: March 2011

Re: [trinity-devel] Estimate When SVN Will Ready

From: Baho Utot <baho-utot@...>
Date: Sat, 26 Mar 2011 13:28:14 -0400
On Saturday 26 March 2011 01:13:55 pm Darrell Anderson wrote:
> How about an estimate when SVN will again be ready to build?
> I see a lot of work going on with interfacing with QT4, which seems to have
> rendered SVN unbuildable.
> I tried building SVN last night and things broke quickly in kdelibs. The
> error had something to do with tqtinterface.
> I realize much is happening under the surface but us mushrooms would
> appreciate a drop of rain now and then. :)
> Darrell

The following builds for me

I got errors on kdebase due to  dbus-tqt but nad kdepim fails

So I am looking to get dbus-tqt and kdebase to build and I'll be a happy 
camper for now.

dbus-tqt build fails with.....

-- Found Threads: TRUE 
CMake Warning at ConfigureChecks.cmake:22 (find_package):
  Could not find module FindTQt.cmake or a configuration file for package

  Adjust CMAKE_MODULE_PATH to find FindTQt.cmake or set TQt_DIR to the
  directory containing a CMake configuration file for TQt.  The file will
  have one of the following names:


Call Stack (most recent call first):
  CMakeLists.txt:24 (include)

CMake Error at CMakeLists.txt:29 (tde_setup_install_path):
  Unknown CMake command "tde_setup_install_path".

-- Configuring incomplete, errors occurred!

Kdepim fails with

Scanning dependencies of target knotes-shared
[ 76%] Building CXX object 
In file included from /trinity.source/kdepim/libkcal/calendar.h:35:0,
                 from /trinity.source/kdepim/libkcal/calendarlocal.h:25,
                 from /trinity.source/kdepim/knotes/knoteslegacy.cpp:42:
/trinity.source/kdepim/libkcal/customproperties.h:27:26: fatal error: 
kdepimmacros.h: No such file or directory
compilation terminated.
make[2]: *** [knotes/CMakeFiles/knotes-shared.dir/knoteslegacy.cpp.o] Error 1
make[1]: *** [knotes/CMakeFiles/knotes-shared.dir/all] Error 2
make: *** [all] Error 2
==> ERROR: A failure occurred in build().

> ---------------------------------------------------------------------
> To unsubscribe, e-mail:
> trinity-devel-unsubscribe@... For additional
> commands, e-mail: trinity-devel-help@... Read list
> messsages on the Web archive:
> Please remember not to top-post: