Message: previous - next
Month: May 2011

arts - CMake error: qiomanager_p.moc not generated

From: "David C. Rankin" <drankinatty@...>
Date: Wed, 11 May 2011 10:21:52 -0500
I apologize if you get 2 copies of this message, I never saw it come through to 
the list....

-------- Original Message --------


   After building qt3 in a pristine build environment, I thought I would build
the rest of trinity there while I had the chance. So far, the dependencies have
built without issue:

(poppler-qt3 still fails)

   Building arts, I have run into another .moc file that isn't generated. This
time it is qiomanager_p.moc. The build gets to 100% and then dies with:

[100%] Building CXX object qtmcop/CMakeFiles/qtmcop-shared.dir/
cd /build/src/build/qtmcop && /usr/bin/c++   -Dqtmcop_shared_EXPORTS
-march=x86-64 -mtune=generic -O2 -pipe  -fPIC -I/opt/qt/include
-I/opt/qt/include/tqt -I/build/src/build/qtmcop -I/build/src/build/mcop
-I/build/src/arts/mcop   -include tqt.h -o
CMakeFiles/qtmcop-shared.dir/ -c /build/src/arts/qtmcop/
/build/src/arts/qtmcop/ fatal error: qiomanager_p.moc: No
such file or directory
compilation terminated.
make[2]: *** [qtmcop/CMakeFiles/qtmcop-shared.dir/] Error 1
make[2]: Leaving directory `/build/src/build'
make[1]: *** [qtmcop/CMakeFiles/qtmcop-shared.dir/all] Error 2
make[1]: Leaving directory `/build/src/build'
make: *** [all] Error 2
==> ERROR: A failure occurred in build().

   Checking the build directory -- no qiomanager_p.moc was every generated.
Could you take a look and see if this is like the kdevelop issue :)

David C. Rankin, J.D.,P.E.

David C. Rankin, J.D.,P.E.