Message: previous - next
Month: June 2012

Re: [trinity-devel] Arch update - gcc 4.7.1 hits testing repo, kwrite crash?

From: "David C. Rankin" <drankinatty@...>
Date: Wed, 20 Jun 2012 10:23:24 -0500
On 06/20/2012 09:02 AM, Darrell Anderson wrote:
> Last night and this morning I pushed several patches:
> avahi-tqt

==> Building - tde-avahi-tqt...
make  all-recursive
make[1]: Entering directory `/build/src/avahi-tqt'
Making all in avahi-tqt
make[2]: Entering directory `/build/src/avahi-tqt/avahi-tqt'
   GEN      qt-watch.moc3
/usr/bin/moc-tqt: line 8: tqmoc: command not found
make  all-am
make[3]: Entering directory `/build/src/avahi-tqt/avahi-tqt'
   CXX      libavahi_tqt_la-qt-watch.lo
qt-watch.cpp:183:25: fatal error: qt-watch.moc3: No such file or directory
compilation terminated.
make[3]: *** [libavahi_tqt_la-qt-watch.lo] Error 1
make[3]: Leaving directory `/build/src/avahi-tqt/avahi-tqt'
make[2]: *** [all] Error 2
make[2]: Leaving directory `/build/src/avahi-tqt/avahi-tqt'
make[1]: *** [all-recursive] Error 1
make[1]: Leaving directory `/build/src/avahi-tqt'
make: *** [all] Error 2

Darrell, does this mean I need to rebuild everything again (TQt3, 
tqtinterface, etc..) in order for the updates to work?

> tdebindings
> python-tqt
> kstreamripper
> tdesvn
> I'm working on kofffice as I write.
> Run git pull for those modules and try again.
> Everything else built. Thus, for any package not listed here, run git pull and try again.

I'm in the process of testing the kwrite crash. If it is fixed, then we are 
golden, however if it still crashes after building on gcc 4.7.1 -- we need an 
ALL-HANDS-ON-DECK push to find the cause.

David C. Rankin, J.D.,P.E.